{"text_format":"1","workbook":"xlsx","n_sheets":9,"sheets":["Inleiding","Contact persoon evaluatie","Risk Register","Maps","Radars","Referentie data user","Referentie data","Referentie data 3","Referentie data 4"],"not_rendered":{"charts":4,"images":0,"macros":1,"external_links":1,"defined_names":15,"comments":1,"pivot_tables":2},"unopened":[],"bounds":{"document_bytes":16777216,"sheet_cells":100000,"rows_first":2000,"rows_last":500,"rows_between":2000,"halvings":0,"cell_chars":16384,"cell_head_chars":4096},"cells_cut":0,"cells_raw":0,"read":"whole","date_system":"1900"}

{"sheet":"Inleiding","index":0,"n_rows":5,"n_cols":2,"rows_kept":5,"cut":false,"hidden":false,"merged":[]}
[]
[null,"INLEIDING"]
[null,"Doel\n\nDeze zelfevaluatie heeft als doel om een idee te hebben over de 'aantoonbaarheid' dat je organisatie conform is met bepaalde punten uit de AVG regelgeving.\n\nWe bekijken hier een aantal punten (risico's) die we geselecteerd hebben uit :\n- de gepubliceerde beslissingen  van de 'geschillenkamer' en 'het algemeen secretariaat' naar aanleiding van klachten (website GBA inspectiedienst – vaststelling cases 2020)\n- de aandachtspunten cases 2020 (website GBA en overheden)\n- onderwerpen uit GBA strategisch plan 2020 – 2025 (website GBA en strategisch plan)\n- risico's die voortkomen doordat begrippen in de regelgeving en richtlijnen niet éénduidig omschreven zijn zoals  de 'deskundigheid' en het 'vermogen' van een DPO',  de 'middelen' die een verwerkingsverantwoordelijke dient ter beschikking te stellen van de DPO  of de ' passende' technische en organisatorische maatregelen  in de regelgeving en in de richtlijnen.  De verwerker en de verwerkingsverantwoordelijke  dient  zijn interpretatie ervan te kunnen argumenten."]
[null,"Methodologie\n\nIn een eerste stap zal je inschatten in hoeverre je aan het punt uit de regelgeving voldoet en in hoeverre het punt toepasbaar is voor je organisatie.  Dit gebeurt door de 'ernst' in te schatten. Deze 'ernst' is in functie van 'de mate waarin je voldoet aan de vraag die wordt gesteld ' en 'de mate dat de vraag relevant is in je context'. Een hoge score voor de  'ernst'  betekent dat men er niet aan voldoet en dat het punt relevant is voor je context. \n\nVervolgens  ga je inschatten in hoeverre je de 2 inschattingen kunt staven ten opzicht van derden. Dit laatste , toegepast op de ernst, geeft je een idee van de 'aantoonbaarheid' (het residueel risico) van je inschattingen in verband met het betreffende punt.  \nOpmerking : \n- het staven van je inschatting in 'hoeverre je aan de regelgeving voldoet' heeft geen nut indien je inschat dat je voor het punt aan de regelgeving niet voldoet (waarde 5 voor kans)\n- het staven van je inschattingen heeft geen nut indien je inschat dat je aan het punt aan de regelgeving niet voldoet (kans 5) en dat het punt relevant is in je context (impact >2). De waarde van de staving is dan '1' (zie drop down keuze mogelijkheden)."]
[null,"\nInterpretatie resultaat\nWanneer het residueel risico 2 of meer is , is het een relatief ernstig risico en moeilijk te staven voor dat punt. \nWanneer de ernst 2 en meer is , kan dit een ernstig risico zijn op het niet naleven van de GDPR voor dat punt. \n"]

{"sheet":"Contact persoon evaluatie","index":1,"n_rows":19,"n_cols":2,"rows_kept":19,"cut":false,"hidden":false,"merged":[]}
[null,"Naam en de contactgegevens verantwoordelijke van de organisatie die eigenaar is van deze register(s) : "]
[null,"Naam organisatie : "]
[null,"algemeen e-mailadres: "]
[null,"Naam verwerkingsverantwoordelijke en/of verwerker :"]
[null,"GSM:"]
[null,"e-mail:"]
[]
[null,"Naam en de contactgegevens van de functionaris voor de gegevensbescherming (DPO) : "]
{"$rows_left_out":12}
{"sheet":"Risk Register","index":2,"n_rows":32,"n_cols":22,"rows_kept":32,"cut":false,"hidden":false,"merged":[]}
["Domain","Risk ID",{"$f":"'Referentie data user'!B1","v":"User Radar"},"       Severity","Risk Name (risk of a vulnerability from a cause with an impact of)","Risk description","Owner","       Prob. (1-5)","       Imp. (1-5)","Maturity description","      Controle","       Residual","       Tolerate","       Treat","       Transfer","       Terminate","Treatement type","Treatement category","Plans proposal","Date","Status","Review comment"]
["De GDPR (continue) governance (Law, guidelines, rules)","G-8-01","DPO",{"$f":"FLOOR((H2+I2)/2,1)","v":1},"Is het mogelijk om op éénvoudige en vlugge manier een copy te overhandigen van het register ?","argumenten voor keuze  'Kans' :\n- 2 : register met de verwerking van persoonsgegevens van 'externe betrokkene' zit centraal, verwerkingen van persoonsgegevens 'interne betrokkene' zit verspreid. \n- 3 : register met de verwerking van persoonsgegevens van 'externe' en 'interne' betrokkene' zit verspreid maar alle departementen hebben werkmeetings gehad voor het opstellen ervan\n- 4 : register met de verwerking van persoonsgegevens van 'externe' en 'interne' betrokkene' zit verspreid en niet alle departementen hebben werkmeetings gehad voor het opstellen ervan\n'argumenten voor keuze  'Impact' :  \n- 5 : ik moet een register hebben volgens de regelgeving\n- 2 : ik denk dat ik geen register moet hebben en verwerk ook geen specifieke persoonsgegevens\n- 1 : ik moet geen register hebben",null,1,1,"1 Bewijsstukken zijn er  niet en /of hebben geen nut (kans = 5 en impact > 2)",{"$f":"MATCH(J2,'Referentie data 3'!$E$2:$E$6,0)-1","v":0},{"$f":"MAX(0,D2-K2)","v":1},null,null,null,null,null,null,null,null,"Identified"]
["De GDPR (continue) governance (Law, guidelines, rules)","G-8-02","Management",{"$f":"FLOOR((H3+I3)/2,1)","v":1},"Zijn er controlemaatregelingen genomen om aan te tonen dat men alle verwerkingen van persoonsgegevens in het verwerkingsregister heeft opgenomen ?","argumenten voor keuze  'Kans' = 2 :  \n- Jaarlijks doorsturen lijst naar VWV ter controle op volledigheid ?\n- Coherentie tussen website – privacy statement & register\n- bij incidenten / advies DPO – controle op aanwezigheid verwerking in register ? \n- Alle informatie staat op een centraal platform dat toegankelijk is voor de VWV , de DPO en de personen die het register dienen up-to-date te houden \n- …..\n",null,1,1,"1 Bewijsstukken zijn er  niet en /of hebben geen nut (kans = 5 en impact > 2)",{"$f":"MATCH(J3,'Referentie data 3'!$E$2:$E$6,0)-1","v":0},{"$f":"MAX(0,D3-K3)","v":1},null,null,null,null,null,null,null,null,"Identified"]
["Controller","NF-8-03C","Verwerkingsverantwoordelijke",{"$f":"FLOOR((H4+I4)/2,1)","v":1},"Voor elke verwerking in het verwerkingsregister :\n- Zijn de doeleinden van de verwerking welbepaald en duidelijk opgenomen in het register ?\n","argumenten voor keuze  'Kans' :\n1 : alle doeleinden zijn ingevuld\n2 : alle doeleinden zijn ingevuld voor de verwerking  van persoonsgegevens van 'externe betrokkenen', en de belangrijkste  'interne verwerkingen' (HR, ICT, ..)  \n3 : alle doeleinden zijn ingevuld voor de verwerking  van persoonsgegevens van 'externe betrokkenen', en geen   'interne verwerkingen'  \n4 : niet alle doeleinden zijn ingevuld voor de verwerking  van persoonsgegevens van 'externe betrokkenen' \n5 : er is minder dan 20 % van de doeleinden ingevuld oor de verwerking  van persoonsgegevens van 'externe betrokkenen' \n'argumenten voor keuze  impact' :\n2 : doeleinden voor de verwerking zijn niet zeer specifiek.",null,1,1,"1 Bewijsstukken zijn er  niet en /of hebben geen nut (kans = 5 en impact > 2)",{"$f":"MATCH(J4,'Referentie data 3'!$E$2:$E$6,0)-1","v":0},1,null,null,null,null,null,null,null,null,"Identified"]
["The processing (systems and related processes)  ","NF-8-04","Management",{"$f":"FLOOR((H5+I5)/2,1)","v":1},"Voor elke verwerking in het verwerkingsregister :\n- Is de categorie van gegevens duidelijk (gevoelige versus niet gevoelige gegevens) ?","argumenten voor keuze  'Kans' :\n1 : alle type gegevens zijn duidelijk aangegeven : functionele categorie, AVG categorie en organisatie interne categorie\n2 : de volgende types zijn duidelijk aangegeven : AVG categorie en organisatie interne categorie\n3 : Het AVG type (specifiek (Art 9) of niet specifiek (Art 9)) is aangegeven\n4 : de functionele categorie of interne categorie is aangegeven\n5 : geen enkele categorie is aangegeven\n'argumenten voor keuze  impact' :\n5 : ik verwerk veel AVG specifieke persoonsgegevens\n4 : ik verwerk AVG specifieke persoonsgegevens\n3 : ik verwerk veel persoonsgegevens maar geen AVG specifieke persoonsgegevens\n2 : ik verwerk persoonsgegevens maar geen AVG specifieke persoonsgegevens\n1 : ik verwerk zeer weinig persoonsgegevens",null,1,1,"1 Bewijsstukken zijn er  niet en /of hebben geen nut (kans = 5 en impact > 2)",{"$f":"MATCH(J5,'Referentie data 3'!$E$2:$E$6,0)-1","v":0},1,null,null,null,null,null,null,null,null,"Identified"]
["the processing (systems and related processes)  ","NF-8-05","Management",{"$f":"FLOOR((H6+I6)/2,1)","v":1},"Voor elke verwerking in het verwerkingsregister :\n- Worden de rechtstreeks verkregen persoonsgegevens niet verder op een met die doeleinden onverenigbare wijze verwerkt (in andere verwerkingen) (doelbinding);","argumenten voor keuze  'Kans' :\n1 : de gegevens worden niet verder verwerkt\n2 : de gegevens worden verder verwerkt maar met die doeleinden verenigbare wijze\n3 : de gegevens worden verder verwerkt maar met die doeleinden waarschijnlijk verenigbare wijze\n4 : de gegevens worden verder verwerkt maar met die doeleinden onwaarschijnlijk verenigbare wijze\n5 : de gegevens worden verder verwerkt met die doeleinden onverenigbare wijze  \n'argumenten voor keuze  impact' :\n5 : de doeleinden zijn er die buiten de verwachtingen liggen van de betrokkene en de 'rechten van de betrokkene' zeker kunnen schaden\n4 : de doeleinden zijn er die buiten de verwachtingen liggen van de betrokkene en de 'rechten van de betrokkene'  kunnen schaden\n3 : de doeleinden zijn er die mogelijks in de verwachtingen liggen van de betrokkene en de 'rechten van de betrokkene' mogelijks  kunnen schaden\n2 : de doeleinden zijn er die  in de verwachtingen liggen van de betrokkene en de 'rechten van de betrokkene' mogelijks kunnen schaden\n1 : de doeleinden zijn er die  in de verwachtingen liggen van de betrokkene en de 'rechten van de betrokkene' (waarschijnlijk) niet zullen schaden",null,1,1,"1 Bewijsstukken zijn er  niet en /of hebben geen nut (kans = 5 en impact > 2)",{"$f":"MATCH(J6,'Referentie data 3'!$E$2:$E$6,0)-1","v":0},1,null,null,null,null,null,null,null,null,"Identified"]
["Controller","NF-8-06","Verwerkingsverantwoordelijke",{"$f":"FLOOR((H7+I7)/2,1)","v":1}," Voor elke verwerking in het verwerkingsregister (rechtmatigheid van de verwerking) :\n-  Is er een rechtsgrond voor de verwerking ?\n","argumenten voor keuze  'Kans' :\n3 : de keuze is  besproken geweest en geen enkele regelgeving gevonden  (ook niet in gelijkaardige context). ",null,1,1,"1 Bewijsstukken zijn er  niet en /of hebben geen nut (kans = 5 en impact > 2)",{"$f":"MATCH(J7,'Referentie data 3'!$E$2:$E$6,0)-1","v":0},1,null,null,null,null,null,null,null,null,"Identified"]
["Controller","NF-8-28","Management",{"$f":"FLOOR((H8+I8)/2,1)","v":1},"Voor elke verwerking waarvan de rechtmatige  rechtsgrond  'gerechtvaardigde belang' is :  heeft men de 3 testen uitgevoerd : de “doeltoets”, de “noodzakelijkheidstoets” en “de afwegingstoets” en heeft men de nodige informatie in een privacy statement transparant gecommuniceerd naar de betrokkene. \n","argumenten voor keuze  'Kans' :\n1 : alle toetsen zijn uitgevoerd en geargumenteerd\n5 : geen enkele toets is uitgevoerd ",null,1,1,"1 Bewijsstukken zijn er  niet en /of hebben geen nut (kans = 5 en impact > 2)",{"$f":"MATCH(J8,'Referentie data 3'!$E$2:$E$6,0)-1","v":0},1,null,null,null,null,null,null,null,null,"Identified"]
{"$rows_left_out":25}
{"sheet":"Maps","index":3,"n_rows":22,"n_cols":13,"rows_kept":22,"cut":false,"hidden":false,"merged":[[14,10,14,11],[3,10,3,11],[1,0,1,12],[12,0,12,12]]}
[]
["Risk Heatmap (do not forget to refresh table)"]
[]
[null,"Count of Risk ID","Prob.",null,null,null,null,null,null,null,"Summary"]
[null,"Imp.",1,2,3,4,5,"Grand Total",null,null,"Negligeable Risks",{"$f":"ColorFunction(K5,$C$6:$G$10,TRUE)","v":29}]
[null,5,null,null,null,null,null,null,null,null,"Acceptable Risks",{"$f":"ColorFunction(K6,$C$6:$G$10,TRUE)","v":0}]
[null,4,null,null,null,null,null,null,null,null,"Moderate Risks",{"$f":"ColorFunction(K7,$C$6:$G$10,TRUE)","v":0}]
[null,3,null,null,null,null,null,null,null,null,"Important Risks",{"$f":"ColorFunction(K8,$C$6:$G$10,TRUE)","v":0}]
{"$rows_left_out":15}
{"sheet":"Radars","index":4,"n_rows":67,"n_cols":22,"rows_kept":67,"cut":false,"hidden":false,"merged":[[0,0,0,8],[17,0,17,8],[34,0,34,8],[51,0,51,8],[7,21,7,29],[7,11,7,19]]}
["Minimal coverage"]
[]
[null,{"$f":"'Referentie data'!C1","v":"Domain"},"#"]
[null,{"$f":"'Referentie data'!$C2","v":"Data subject"},{"$f":"COUNTIF('Risk Register'!$A$2:$A$1025, Radars!B4)","v":2}]
[null,{"$f":"'Referentie data'!$C3","v":"Processor"},{"$f":"COUNTIF('Risk Register'!$A$2:$A$1025, Radars!B5)","v":2}]
[null,{"$f":"'Referentie data'!$C4","v":"Controller"},{"$f":"COUNTIF('Risk Register'!$A$2:$A$1025, Radars!B6)","v":7}]
[null,{"$f":"'Referentie data'!C7","v":"De GDPR (continue) governance (Law, guidelines, rules)"},{"$f":"COUNTIF('Risk Register'!$A$2:$A$1025, Radars!B7)","v":7}]
[null,{"$f":"'Referentie data'!C5","v":"The processing (systems and related processes)  "},{"$f":"COUNTIF('Risk Register'!$A$2:$A$1025, Radars!B8)","v":10},null,null,null,null,null,null,null,null,"Standard Radars",null,null,null,null,null,null,null,null,null,"User Radars"]
{"$rows_left_out":60}
{"sheet":"Referentie data user","index":5,"n_rows":30,"n_cols":2,"rows_kept":30,"cut":false,"hidden":false,"merged":[]}
["STATUS","User Radar"]
["Identified","Verwerkingsverantwoordelijke"]
["Open","Management"]
["In Progress","Operations"]
["On Hold","ICT"]
["Closed (archived)","DPO"]
[]
[]
{"$rows_left_out":23}
{"sheet":"Referentie data","index":6,"n_rows":38,"n_cols":5,"rows_kept":38,"cut":false,"hidden":false,"merged":[]}
["STATUS (zie ref data user)","R user (zie ref data user)","Domain","Requirement","ISO Groep / Beleidslijn / contrôle"]
[" "," ","Data subject","Security & privacy (Non Functional requirements) ","05 Informatieveiligheidsbeleid"]
[" "," ","Processor","Security (Non Functional requirements) ","06 Organisatie van informatieveiligheid"]
[" "," ","Controller","Confidentiality","07 Personeelsgerelateerde aspecten "]
[" "," ","The processing (systems and related processes)  ","Integrity","08 Beheer van middelen"]
[" "," ","Data transfer (third party & international)","Availability","09 Logische toegangsbeveiliging"]
[null,null,"De GDPR (continue) governance (Law, guidelines, rules)","Authenticity","11 Fysieke toegangsbeveiliging"]
[null,null,null,"Reliability","12 Operationele aspecten"]
{"$rows_left_out":31}
{"sheet":"Referentie data 3","index":7,"n_rows":8,"n_cols":6,"rows_kept":8,"cut":false,"hidden":false,"merged":[]}
["Type of treatment","Comments","category of tratement","Comments","Maturity description","Impact / Kans"]
["Directive. ","(Richtlijn door organisatorische, technische of fysieke acties). Begeleiden van personeel, aannemers en bezoekers over het verwachte gedrag binnen de beveiligingsomgeving","Administr. ","Handmatige / administratieve controles verwijzen meestal naar acties die personen al dan niet kunnen uitvoeren.","1 Bewijsstukken zijn er  niet en /of hebben geen nut (kans = 5 en impact > 2)",1]
["Deterrent.","(Afschrikken door organisatorische, technische of fysieke acties). Ontwerp zo dat de inspanning om de besturing te omzeilen of te compromitteren groter is dan de waarde die wordt waargenomen bij het breken ervan; ontmoedigt overtredingen.","Technical","Geautomatiseerde / technische handelingen worden beheerd of uitgevoerd door computersystemen.","2 Aantoonbaar bewijs (dat ter beschikking is) dat andere organisaties dezelfde interpretatie toepassen of eenzelfde antwoord hebben op de vraag.",2]
["Preventive.","(preventief door organisatorische, technische of fysieke acties). Om te voorkomen dat een evenement plaatsvindt / zal voltooid worden. \nvoorkomen dat wijzigingen in systemen en procedures per ongeluk de CIA gaan verminderen","Physical","Fysieke controles omvatten sloten, hekken en zelfs geografisch specifieke bedieningselementen.","3 geschriften (die ter beschikking zijn) die aantonen dat men het aldus uitvoert of dat men een zorgvuldig onderzoek heeft uitgevoerd van alle relevante feiten alvorens men een beslissing heeft genomen : mails, verslagen van meetings, registers, ..",3]
["Compensating.","(Compenseren door organisatorische, technische of fysieke acties). Zal ingeschakeld worden wanneer de bestaande besturingselementen niet voldoende voldoen aan de vereisten die worden beschreven in het beveiligingsbeleid",null,null,"4 bewijs (dat ter beschikking is) door een regelgeving of acte in een gelijkaardige context of interpretatie van een toezichthoudende autoriteit (inspectie rapporten, ..).",4]
["Detective. ","detective door organisatorische, technische of fysieke acties).: kennisgeving aan geschikt personeel (als de afschrikkende en preventieve controles niet hebben gewerkt op een aanval)",null,null,"5 bewijs (dat ter beschikking is) door een regelgeving of authentieke of onderhandse acte die toepasbaar is.",5]
["Corrective.  ","correctief door organisatorische, technische of fysieke acties). : maatregelen om effect terug te draaien als er iets is gebeurd. "]
["Recovery.","herstel door organisatorische, technische of fysieke acties).. Zodra de veiligheidsgerelateerde gebeurtenis voorbij is, is het noodzakelijk om het systeem terug te brengen naar 'normale operaties'"]
{"$rows_left_out":1}
{"sheet":"Referentie data 4","index":8,"n_rows":55,"n_cols":2,"rows_kept":55,"cut":false,"hidden":false,"merged":[]}
["Treatement (control)","Objectives / comments "]
["strategische privacy & security policies / principes  vastleggen  ","Kernprincipes minimale normen (https://www.ksz-bcss.fgov.be/nl/gegevensbescherming/informatieveiligheidsbeleid)\nVastleggen van principe 'least privilege’\nVastleggen van principe 'Need to know’\nVastleggen van principe ' Separation of Privilege '\nVastleggen van principe 'Fail-save default'\nVastleggen van principe 'Simplicity of the design' & 'Psychological acceptable '\nVastleggen van principe 'Defense-in-Depth Approach'\nVastleggen van principe 'Layered Security (defense) Approach'\nVastleggen van principe 'passive or dynamic security approach '\nVastleggen van principe 'A threat based defense Approach'\nVastleggen van principe 'Zero trust approach'"]
["Verminder het identificerende karakter van persoonsgegevens","Mogelijkheden\n- de gebruiker kan een bron of een dienst gebruiken zonder het risico te lopen zijn / haar identiteit bekend te maken door het het identificerende karakter van persoonsgegevens wegnemen (anonieme gegevens) (gedeeltelijke verwijdering, codering , hashing,  de link en de correlatie tussen gebeurtenissen, personen en gegevens verbreken, de gegevens anonimiseren door ze op een default waarde te zetten ...);\nvb. Tor, the onion router, maakt websurfen anoniem. Je browser maakt niet direct contact met de webserver. De verbinding wordt opgezet via drie tussenliggende Tor nodes. Deze verbinding zijn versleuteld. Zo kan de webserver, je internet service provider, of een willekeurige derde partij (zelfs de Tor nodes) niet meer zien welke websites je bezoekt\n- de gebruiker kan een bron of dienst gebruiken zonder zijn identiteit bekend te maken, maar blijft identificeerbaar (pseudonieme gegevens);\n- de gebruiker kan meerdere keren gebruik maken van bronnen of diensten zonder het risico dat dit gebruik aan elkaar kan worden gekoppeld (niet-correleerbare gegevens);\n- de gebruiker kan een bron of dienst gebruiken zonder risico dat anderen, met name derden, kunnen waarnemen dat de bron of dienst wordt gebruikt (niet-observeerbaarheid).\n\nDe keuze van een methode zal afhangen van de bedreigingen/ risico's. Voor sommige soorten bedreigingen is pseudonimisering geschikter dan anonimisering (bijvoorbeeld als er traceerbaarheid vereist is).Sommige privacyrisico's worden aangepakt door een combinatie van verschillende methoden.\n\n\n\n\n"]
["Archiveren","methoden voor het bewaren en beheren van elektronische archieven die persoonsgegevens bevatten met als bedoeling onder andere de de noodzakelijke duur van de bewaring (retentie tijd) te garanderen (opslag, migratie, toegankelijkheid, verwijdering, archiveringsbeleid, bescherming van vertrouwelijkheid, enz.)."]
["Encryptie","(Versleutelen) persoonsgegevens onbegrijpelijk maken voor onbevoegden wanneer ze bijvoorbeeld toegang hebben tot de gegevens (symmetrische of asymmetrische codering, gebruik van krachtige openbare algoritmen, certificaat van authenticatie, enz.) of beschikken (bij herstellen, hergebruik, transfer) over de hardware waar de gegevens op staan (werkstation, server, verwisselbare media, etc.) of bij serverdiefstal, onwettige fysieke toegang tot het werkstation of de server en directe toegang tot servergegevens door een admin beheerder of bij onderschepping van elektronische berichten (mailsysteem of dataflux) (vb. IPSEC, TLS, SSH (VPN)).\n\nZie ook beleidslijn 'Vercijferen' (https://www.ksz-bcss.fgov.be/nl/veiligheid-en-privacy/publicaties/minimale-normen)"]
["Scheiden van de persoonsgegevens en van de verwerking van persoonsgegevens","om de mogelijkheid te verkleinen om persoonlijke gegevens met elkaar te correleren of om een inbreuk te voorkomen op alle gegevens tegelijkertijd ((bedrijfswijd) Conceptueel informatiemodel (met afhankelijkheidsrelaties) als basis voor de groepering, logische informatiemodel, fysisch modellen, … enz.)."]
["Fysieke toegangscontrole verbeteren","onbevoegden geen fysiek toegang geven tot persoonlijke gegevens (verschillende veiligheidszones in het gebouw, lijst van geautoriseerde personen, authenticatie van werknemers en bezoekers, traceer toegang, waarschuwing in geval van inbraak, enz.).\nZie ook beleidslijn 'Fysieke toegangsbeveiliging'  (https://www.ksz-bcss.fgov.be/nl/veiligheid-en-privacy/publicaties/minimale-normen)"]
["Integriteitscontrole op de gegevens implementeren","gewaarschuwd worden als er een ongewenste wijziging of verdwijning van persoonlijke gegevens is (hashfunctie (genereren van een vingerafdruk (hash) van de gegevens vb. SHA-256), authenticatiecode aan een bericht toekennen (MAC), elektronische handtekening (om veranderingen van gegevens door andere dan de ondertekenaar te voorkomen), voorkoming van SQL-injectie, enz.)."]
{"$rows_left_out":47}