{"text_format":"1","workbook":"xlsx","n_sheets":12,"sheets":["Comment utiliser","Personne de contact -évaluation","Risk Register","Maps","Radars","Scales","RGPD","Données de référence Uti","Données de référence","Données de référence 1 ","Données de référence 2","Données de référence 3"],"not_rendered":{"charts":4,"images":0,"macros":1,"external_links":3,"defined_names":33,"comments":1,"pivot_tables":2},"unopened":[],"bounds":{"document_bytes":16777216,"sheet_cells":100000,"rows_first":2000,"rows_last":500,"rows_between":2000,"halvings":0,"cell_chars":16384,"cell_head_chars":4096},"cells_cut":0,"cells_raw":0,"read":"whole","date_system":"1900"}

{"sheet":"Comment utiliser","index":0,"n_rows":5,"n_cols":2,"rows_kept":5,"cut":false,"hidden":false,"merged":[]}
[]
[null,"INLEIDING"]
[null,"Doel\n\nDeze zelfevaluatie heeft als doel om een idee te hebben over de 'aantoonbaarheid' dat je organisatie conform is met bepaalde punten uit de AVG regelgeving.\n\nWe bekijken hier een aantal punten (risico's) die we geselecteerd hebben uit :\n- de gepubliceerde beslissingen  van de 'geschillenkamer' en 'het algemeen secretariaat' naar aanleiding van klachten (website GBA inspectiedienst – vaststelling cases 2020)\n- de aandachtspunten cases 2020 (website GBA en overheden)\n- onderwerpen uit GBA strategisch plan 2020 – 2025 (website GBA en strategisch plan)\n- risico's die voortkomen doordat begrippen in de regelgeving en guidelines niet éénduidig omschreven zijn zoals  de 'deskundigheid' en het 'vermogen' van een DPO',  de 'middelen' die een verwerkingsverantwoordelijke dient ter beschikking te stellen van de DPO  of de ' passende' technische en organisatorische maatregelenen  in de regelgeving en in de guidelines.  De verwerker en de verwerkingsverantwoordelijke  dient  zijn interpretaie ervan te kunnen argumenten."]
[null,"Methodologie\n\nIn een eerste stap zal je inschatten in hoeverre je aan het punt uit de regelgeving voldoet en in hoeverre het punt toepasbaar is voor je organisatie.  Dit gebeurt door de 'ernst' in te schatten. Deze 'ernst' is in functie van 'de mate waarin je voldoet aan de vraag die wordt gesteld ' en 'de mate dat de vraag relevant is in je context'. Een hoge score voor de  'ernst'  betekent dat men er niet aan voldoet en dat het punt relevant is voor je context. \n\nVervolgens  ga je inschatten in hoeverre je de 2 inschattingen kunt staven ten opzicht van derden. Dit laatste , toegepast op de ernst, geeft je een idee van de 'aantoonbaarheid' (het residueel risico) van je inschattingen in verband met het betreffende punt.  \nOpmerking : \n- het staven van je inschatting in 'hoeverre je aan de regelgeving voldoet' heeft geen nut indien je inschat dat je voor het punt aan de regelgeving niet voldoet (waarde 5 voor probailiteit)\n- het staven van je inschattingen heeft geen nut indien je inschat dat je aan het punt aan de regelgeving niet voldoet (probiliteit 5) en dat het punt relevant is in je context (impact >2). De waarde van de stavingen is dan '1' (zie drop down keuze mogelijkheden)."]
[null,"\nInterpretatie resultaat\nWanneer het residueel risico 2 of meer is , is het een relatief ernstig risico en moeilijk te staven voor dat punt. \nWanneer de ernst 2 en meer is , kan dit een ernstig risico zijn op het niet naleven van de GDPR voor dat punt. \n"]

{"sheet":"Personne de contact -évaluation","index":1,"n_rows":19,"n_cols":2,"rows_kept":19,"cut":false,"hidden":false,"merged":[]}
[null,"Naam en de contactgegevens verantwoordelijke van de organisatie die eigenaar is van deze register(s) : "]
[null,"Naam organisatie : "]
[null,"algemeen e-mailadres: "]
[null,"Naam verwerkingsverantwoordelijke en/of verwerker :"]
[null,"GSM:"]
[null,"e-mail:"]
{"$rows_left_out":14}
{"sheet":"Risk Register","index":2,"n_rows":32,"n_cols":22,"rows_kept":32,"cut":false,"hidden":false,"merged":[]}
["Domain","Risk ID",{"$f":"'[2]Referentie data user'!B1","v":"User Radar"},"       Severity","Risk Name (risk of a vulnerability from a cause with an impact of)","Risk description","Owner","       Prob. (1-5)","       Imp. (1-5)","Maturity description","      Contrôle","       Residual","       Tolerate","       Treat","       Transfer","       Terminate","Treatement type","Treatement category","Plans proposal","Date","Status","Review comment"]
["La gouvernance RGPD (Loi, lignes directrices, règles )","G-8-01","DPO",{"$f":"FLOOR((H2+I2)/2,1)","v":1},"Est-il possible de transmettre une copie du registre de manière simple et rapide ?","arguments pour le choix  'probabilité' :\n- 2 : registre avec le traitement de données à caractères personnel de « personne concernée externe » est centralisé, traitements de données à caractère personnel « personne concernée interne » sont dispersés. \n- 3 : registre avec le traitement de données à caractère personnel de personnes concernées ‘externes’ et ‘internes’ est dispersé, mais tous les départements ont participé à des réunions de travail en vue de sa création\n- 4 : registre avec le traitement de données à caractère personnel de personnes concernées ‘externes’ et ‘internes’ est dispersé et tous les départements n’ont pas participé à des réunions de travail en vue de sa création\n'arguments pour choix  'Impact' :  \n- 5 : je dois avoir un registre en vertu de la réglementation\n- 2 : je pense que je ne dois pas avoir de registre et je ne traite pas de données à caractère personnel spécifiques\n- 1 : je ne dois pas avoir de registre",null,1,1,"1 Il n'y a aucune preuve et/ou n'est d'aucune utilité (probabilité = 5 et impact > 2) ",{"$f":"MATCH(J2,'Données de référence 3'!$E$2:$E$6,0)-1","v":0},{"$f":"MAX(0,D2-K2)","v":1},null,null,null,null,null,null,null,null,"Identified"]
["La gouvernance RGPD (Loi, lignes directrices, règles )","G-8-02","Management",{"$f":"FLOOR((H3+I3)/2,1)","v":1},"Des mesures de contrôle sont-elles prévues pour prouver que tous les traitements de données à caractère personnel sont repris dans le registre de traitement ?","arguments pour choix 'probabilité' = 2 :  \n- Transmission annuelle de la liste vers le responsable du traitement pour contrôle de l'exhaustivité ?\n- Cohérence entre site web – déclaration de confidentialité & registre\n- En cas d'incidents / avis DPO – contrôle de la présence du traitement dans le registre ? \n- Toutes les informations sont disponibles sur une plateforme centrale qui est accessible au responsable du traitement, au DPO et aux personnes chargées de tenir à jour le registre \n- …..\n",null,1,1,"1 Il n'y a aucune preuve et/ou n'est d'aucune utilité (probabilité = 5 et impact > 2) ",{"$f":"MATCH(J3,'Données de référence 3'!$E$2:$E$6,0)-1","v":0},{"$f":"MAX(0,D3-K3)","v":1},null,null,null,null,null,null,null,null,"Identified"]
["Le responsable du traitement","NF-8-03C","Responsable du traitement",1,"Pour chaque traitement repris dans le registre des traitements :\n- Les finalités du traitement sont-elles déterminées et clairement mentionnées dans le registre ?\n","arguments pour choix  'probabilité' :\n1 : toutes les finalités sont mentionnées\n2 : toutes les finalités sont mentionnées pour le traitement de données à caractère personnel de 'personnes concernées externes' et pour les principaux 'traitements internes' (HR, ICT, ..)  \n3 : toutes les finalités sont mentionnées pour le traitement de données à caractère personnel de 'personnes concernées externes' et pas de 'traitements internes'  \n4 : les finalités ne sont pas toutes mentionnées pour le traitement de données à caractère personnel de 'personnes concernées externes'  \n5 : moins de 20 % des finalités est mentionné pour le traitement de données à caractère personnel de 'personnes concernées externes' \n'arguments pour choix  impact' :\n2 : les finalités du traitement ne sont pas très spécifiques.",null,1,1,"1 Il n'y a aucune preuve et/ou n'est d'aucune utilité (probabilité = 5 et impact > 2) ",{"$f":"MATCH(J4,'Données de référence 3'!$E$2:$E$6,0)-1","v":0},1,null,null,null,null,null,null,null,null,"Identified"]
["Le traitement (système et processus opérationnels) ","NF-8-04","Management",1,"Pour chaque traitement dans le registre des traitements:\n- la catégorie des données est-elle claire (données sensibles versus non-sensibles) ?","arguments pour choix  'probabilité' :\n1 : tous les types de données sont clairement indiqués : catégorie fonctionnelle, catégorie RGPD et catégorie organisation interne\n2 : les types suivants sont clairement indiqués : catégorie RGPD et catégorie organisation interne\n3 : le type RGPD (spécifique (art. 9) ou non-spécifique (art. 9)) est clairement indiqué\n4 : la catégorie fonctionnelle ou la catégorie interne est indiquée\n5 : aucune catégorie n'est indiquée\n'arguments pour choix  impact' :\n5 : je traite beaucoup de données à caractère personnel spécifiques RGPD\n4 : je traite des données à caractère personnel spécifiques RGPD\n3 : je traite beaucoup de données à caractère personnel mais pas de données à caractère personnel spécifiques RGPD\n2 : je traite des données à caractère personnel mais pas de données à caractère personnel spécifiques RGPD\n1 : je traite très peu de données à caractère personnel",null,1,1,"1 Il n'y a aucune preuve et/ou n'est d'aucune utilité (probabilité = 5 et impact > 2) ",{"$f":"MATCH(J5,'Données de référence 3'!$E$2:$E$6,0)-1","v":0},1,null,null,null,null,null,null,null,null,"Identified"]
["Le traitement (système et processus opérationnels) ","NF-8-05","Management",1,"Pour chaque traitement dans le registre des traitements :\n- Les données à caractère personnel obtenues directement ne sont-elles pas traitées ultérieurement pour une finalité non compatible avec les finalités initiales (limitationde la finalité)?","arguments pour choix  'probabilité' :\n1 : les données ne sont pas traitées ultérieurement\n2 : les données sont traitées ultérieurement mais pour une finalité compatible\n3 : les données sont traitées ultérieurement mais pour une finalité probablement compatible\n4 : les données sont traitées ultérieurement mais pour une finalité probablement incompatible\n5 : les données sont traitées ultérieurement pour des finalités incompatibles avec les finalités initiales  \n'arguments pour choix  impact' :\n5 : les finalités ne répondent pas aux attentes raisonnables de l'intéressé et peuvent certainement nuire aux droits de l'intéressé\n4 : les finalités ne répondent pas aux attentes raisonnables de l'intéressé et peuvent nuire aux droits de l'intéressé\n3 : les finalités répondent éventuellement aux attentes de l'intéressé et peuvent éventuellement nuire aux droits de l'intéressé\n2 :  les finalités répondent aux attentes de l'intéressé et peuvent éventuellement nuire aux droits de l'intéressé\n1 :  les finalités répondent aux attentes de l'intéressé et ne nuiront (probalement) pas aux droits de l'intéressé",null,1,1,"1 Il n'y a aucune preuve et/ou n'est d'aucune utilité (probabilité = 5 et impact > 2) ",{"$f":"MATCH(J6,'Données de référence 3'!$E$2:$E$6,0)-1","v":0},1,null,null,null,null,null,null,null,null,"Identified"]
{"$rows_left_out":27}
{"sheet":"Maps","index":3,"n_rows":22,"n_cols":13,"rows_kept":22,"cut":false,"hidden":false,"merged":[[14,10,14,11],[3,10,3,11],[1,0,1,12],[12,0,12,12]]}
[]
["Risk Heatmap (do not forget to refresh table)"]
[]
[null,"Count of Risk ID","Prob.",null,null,null,null,null,null,null,"Summary"]
[null,"Imp.",1,2,3,4,5,"Grand Total",null,null,"Negligeable Risks",{"$f":"ColorFunction(K5,$C$6:$G$10,TRUE)","v":25}]
[null,5,null,null,null,null,1,1,null,null,"Acceptable Risks",{"$f":"ColorFunction(K6,$C$6:$G$10,TRUE)","v":1}]
{"$rows_left_out":17}
{"sheet":"Radars","index":4,"n_rows":67,"n_cols":22,"rows_kept":67,"cut":false,"hidden":false,"merged":[[0,0,0,8],[17,0,17,8],[34,0,34,8],[51,0,51,8],[7,21,7,29],[7,11,7,19]]}
["Minimal coverage"]
[]
[null,{"$f":"'Données de référence'!C1","v":"Domain"},"#"]
[null,{"$f":"'Données de référence'!$C2","v":"La personne concernée"},{"$f":"COUNTIF('Risk Register'!$A$2:$A$30, Radars!B4)","v":2}]
[null,{"$f":"'Données de référence'!$C3","v":"Le sous-traitant "},{"$f":"COUNTIF('Risk Register'!$A$2:$A$30, Radars!B5)","v":2}]
[null,{"$f":"'Données de référence'!$C4","v":"Le responsable du traitement"},{"$f":"COUNTIF('Risk Register'!$A$2:$A$30, Radars!B6)","v":7}]
{"$rows_left_out":62}
{"sheet":"Scales","index":5,"n_rows":38,"n_cols":9,"rows_kept":38,"cut":false,"hidden":false,"merged":[[1,2,1,6],[9,2,9,6],[26,2,26,6],[32,2,32,6]]}
[]
[null,null,"PROBABILITY Level"]
[null,null,"RARE","OCCASIONAL","POSSIBLE","REGULAR","OFTEN"]
[null,null,1,2,3,4,5]
[null,null,"Maximum every 30 years","Maximum every 10 years","Maximum each year","Maximum each month","Maximum everydays "]
[null,null,"it does not seem possible that the risk will realize the threat (become an issue)","it seems difficult that the risk will realize the threat  (become an issue)","it seems possible that the risk will realize the threat (become an issue)","it seems  easy that the risk will realize the threat (become an issue) ","it seems extremely easy that the risk will realize the threat (become an issue) "]
{"$rows_left_out":33}
{"sheet":"RGPD","index":6,"n_rows":57,"n_cols":2,"rows_kept":57,"cut":false,"hidden":false,"merged":[]}
["Ref RGPD","Réglementation RGPD"]
["1-4","CH1 DISPOSITIONS GÉNÉRALES"]
["5-11","CH2 PRINCIPES"]
["5","Principes en matière de traitement des données à caractère personnel"]
["6","Légitimité du traitement"]
["7","Conditions applicables au consentement"]
{"$rows_left_out":52}
{"sheet":"Données de référence Uti","index":7,"n_rows":30,"n_cols":2,"rows_kept":30,"cut":false,"hidden":false,"merged":[]}
["STATUS","User Radar"]
["Identified","Responsable du traitement"]
["Open","Management"]
["In Progress","Operations"]
["On Hold","ICT"]
["Closed (archived)","DPO"]
{"$rows_left_out":25}
{"sheet":"Données de référence","index":8,"n_rows":38,"n_cols":6,"rows_kept":38,"cut":false,"hidden":false,"merged":[]}
["STATUS (voir données de référence Uti)","User Radar (voir données de référence Uti)","Domain","Requirement","ISO Groep / Beleidslijn / contrôle","Domain details"]
[" "," ","La personne concernée","Security & privacy (Non Functional requirements) ","05 Politique sécurité information","Administrator workstations"]
[" "," ","Le sous-traitant ","Security (Non Functional requirements) ","06 Organisation de la sécurité de l'information","Archivering"]
[" "," ","Le responsable du traitement","Confidentiality","07 Aspects relatifs à la personne ","Backup management"]
[" "," ","Le traitement (système et processus opérationnels) ","Integrity","08 Gestion des moyens","Building"]
[" "," ","Portabilité et transfert (tiers - international) ","Availability","09 Sécurisation d'accès logique","Cloud service"]
{"$rows_left_out":33}
{"sheet":"Données de référence 1 ","index":9,"n_rows":199,"n_cols":13,"rows_kept":199,"cut":false,"hidden":false,"merged":[]}
["Type de traitement (réf.  WP 248 EEC et CPVP)","Type de support dans le contexte du RGPD (*)","Niveau de classification (mentionnez le nom du document [XX] décrivant le processus de classification interne)","Catégorie de données RGPD ","Catégorie(s) d'intéressés (WP 248)","Licéité du traitement (article 6)",null,"Liste indicative de la (des) catégorie(s) de destinataires ","Pays","Nature du transfert vers un pays tiers/une organisation internationale (article 49)","Indication","Support des données à caractère personnel "]
["Pas de type spécifique --> si aucun des types ci-dessous","Common known technology","Privé","N'appartient pas à une catégorie particulières","Vulnerable natural persons data subject which require protection of personal data (6) (Recital 75)","****pour les données personnelles non particulières"," ","La personne enregistrée elle-même","Afghanistan","Transferts fondé sur une décision d'adéquation","Article 45 RGPD","Software (application business, OS, messaging, DB, etc.)"," "]
["Évaluation d'individus dont le profiling et l'établissement de pronostics","Innovative technology","Interne","Données génétiques en vue de l'identification unique d'une personne (article 9 RGPD)","Employee when opposing to the processing performed by employer when linked to HR management (WP 248 EEC)","Consentement de l'intéressé ","L'intéressé a consenti au traitement de ses données à caractère personnel pour une ou plusieurs finalités spécifiques (article 6.1a RGPD).  Attention : le consentement doit satisfaire aux conditions visées à l'article 7 du RGPD. ","Relations personnelles des personnes enregistrées","Albania","Transfert moyennant des garanties appropriées","Article 46 RGPD","Documents/dossiers papier (impression, photocopie, etc.)"]
["Décisions automatisées avec des effets juridiques ou des effets notables comparables (WP 248 EEC)","Cloud","Confidentiel","Données biométriques en vue de l'identification unique d'une personne (article 9 RGPD)","Children (6,8, ..)","Nécessaire à l'exécution d'un contrat","Le traitement est nécessaire à l'exécution d'un contrat auquel la personne concernée est partie ou à l'exécution de mesures précontractuelles prises à la demande de celle-ci (article 6.1b) RGPD)","Conseillers professionnels de la personne enregistrée","Algeria","Transfert sur la base de règles d'entreprise contraignantes","Article 47 RGPD","Canaux de communication électroniques (câble, sans fil, fibre optique, etc.) "]
["Monitoring systématique (suivi, monitoring et contrôle de la personne concernée) (enregistrement audio ou vidéo) (WP 248 EEC)","Internet of things","Hautement confidentiel","Données de santé (article 9 RGPD)","the mentally ill (WP 248 EEC)","Obligation légale","Le traitement est nécessaire au respect d'une obligation légale à laquelle le responsable du traitement est soumis (article 6.1c) RGPD)","Employeur ou relations de travail de la personne enregistrée ","Andorra","Transfert sur la base d'une dérogation pour des situations spécifiques","Article 49.1 RGPD","Flux papier (e-mail, workflow, etc.)"]
["Traitements de données à grande échelle ou traitements ayant des conséquences pour un grand nombre d'intervenants (WP 248 EEC). ","Blockchain","Données sociales confidentielles","Données qui révèlent l'origine raciale ou ethnique (article 9 RGPD)","Asylum seekers  (WP 248 EEC)","Protection des intérêts vitaux de la personne concernée","Le traitement est nécessaire à la sauvegarde des intérêts vitaux de la personne concernée ou d'une autre personne physique (article 6.1d RGPD)","Autres services ou entreprises annexes du responsable du traitement","Angola","Transfert sur la base de la condition de l'article  49.2 RGPD","Article 49.2 RGPD","HW et SW livrés par des utilisateurs (smartphones, tablettes, navigateur internet, SW sur PC, internet TV, etc.)"]
{"$rows_left_out":194}
{"sheet":"Données de référence 2","index":10,"n_rows":105,"n_cols":5,"rows_kept":105,"cut":false,"hidden":false,"merged":[]}
["Objectif du traitement (ref. guichet électronique CBPL)",null,"Catégorie de données fonctionnelle"]
["(Objectis généraux)","Comments"," (Données d'identification)","Comments"]
["Administration du personnel et des intermédiaires","Recrutement et sélection du personnel et des intermédiaires (courtiers, représentants autonomes...) Administration des salaires, rémunérations, commissions et traitements.  Application de la législation sociale. ","Données d'identification personnelles","Nom, titre, adresse (privée, professionnelle), adresses précédentes, numéro de téléphone (privé, professionnel), données d’identification attribuées par le responsable. "]
["Gestion du personnel et des intermédiaires","Évaluation et suivi du personnel et des intermédiaires. Planification et suivi du personnel et des intermédiaires. ","Données d'identification, autres que le Numéro de registre national, émises par l'État","Numéro de carte d'identité, numéro de passeport, numéro de permis de conduire, numéro de pension, plaque d'immatriculation... "]
["Planification des activités","Planification et suivi des tâches, de la charge de travail et des prestations.","Données d'identification électroniques","Adresses IP, cookies, moments de connexion... "]
["Contrôle sur le lieu de travail","Contrôle de l'activité professionnelle sur le lieu de travail à l'aide de caméras ou de systèmes informatiques comme par exemple le contrôle des e-mails, de l'utilisation d'internet, du téléphone... ","Données de localisation électroniques","GSM, GPS…"]
{"$rows_left_out":100}
{"sheet":"Données de référence 3","index":11,"n_rows":8,"n_cols":6,"rows_kept":8,"cut":false,"hidden":false,"merged":[]}
["Type of treatment","Comments","category of tratement","Comments","Maturity description","Impact / Kans"]
["Directive. ","(Ligne directrice par des actions organisationnelles, techniques ou physiques). Conseiller le personnel, les entrepreneurs et les visiteurs sur le comportement attendu dans l'environnement de sécurité","Administr. ","Handmatige / administratieve controles verwijzen meestal naar acties die personen al dan niet kunnen uitvoeren.","1 Il n'y a aucune preuve et/ou n'est d'aucune utilité (probabilité = 5 et impact > 2) ",1]
["Deterrent.","(Découragé par des actions organisationnelles, techniques ou physiques). Conçu de manière à ce que l’effort de contourner ou de compromettre le contrôle soit supérieur à la valeur observée lorsqu’il est brisé; décourage les violations.","Technical","Geautomatiseerde / technische handelingen worden beheerd of uitgevoerd door computersystemen.","2 Preuve démontrable (qui est disponible) que d'autres organisations appliquent la même interprétation ou ont la même réponse à la question. ",2]
["Preventive.","(préventif par des actions organisationnelles, techniques ou physiques).  Pour éviter qu’un événement ne se produise / se termine.  \nempêcher les modifications des systèmes et des procédures de réduire accidentellement la CIA","Physical","Fysieke controles omvatten sloten, hekken en zelfs geografisch specifieke bedieningselementen.","3 écrits (disponibles) qui montrent qu'il est effectué de cette manière ou qu'une enquête minutieuse de tous les faits pertinents a été effectuée avant de prendre une décision : courriels, comptes rendus de réunions, registres, .. ",3]
["Compensating.","(Compensation par des actions organisationnelles, techniques ou physiques).  Sera activé lorsque les contrôles existants ne répondent pas aux exigences décrites dans la politique de sécurité.",null,null,"4 la preuve (qui est disponible) par un règlement ou un acte dans un contexte similaire ou l'interprétation d'une autorité de contrôle (rapports d'inspection, ..). ",4]
["Detective. ","détective par des actions organisationnelles, techniques ou physiques): notification au personnel compétent (si les contrôles dissuasifs et préventifs n’ont pas fonctionné lors d’une attaque)",null,null,"5 preuve (qui est disponible) par tout règlement applicable ou acte authentique ou sous seing privé. ",5]
{"$rows_left_out":2}